Beyblade burst turbo episode 16 english dub
Operational plan for hotel
(1) * 3-2 9 7-5 1 7-(1) 1 1 * * 3-2 9 7-5 1 7 PROFESSIONAL DISC CAMCORDER PROFESSIONAL DISC CAMCORDER PDW-700 PDW-700 The supplied CD-ROM includes operation manuals for the PDW-700 Professional Disc Camcorder (English, Japanese, French, German, Italian, Spanish and Chinese versions) in PDF format.
Bakugou x toddler reader
開発メモ その198 Could not initialize class org.codehaus.groovy.reflection.ReflectionCache Introduction Could not initialize class org.codehaus.groovy.reflection.ReflectionCache というエラーが表示される。
Federal rules of evidence flowchart
Я столкнулся с этой проблемой, когда создавал свое приложение Flutter. Эта ошибка связана с версией gradle, которую вы используете в своем Android-проекте.
Prometheus greek mythology
May 03, 2012 · NoClassDefFoundError: Could not initialize class org.intellij.plugins.relaxNG.compact.RncTokenTypes: Could not initialize class org.intellij.plugins.relaxNG.compact.RncTokenTypes Benzer hatalar bu firmanın diğer ürünlerinde de var. Daha önce PhpStorm’u denediğim dönemlerde internette kısa bir arama ile problemin Windows’un “local ...
Ties and slurs worksheet
parseSdkContent failed Could not initialize class android.graphics.Typeface - jerrys 来自 技术开发 由 博客园_首页 发布于 2015-02-15 05:00:00 When I open layout editor,eclipseis giving this error:parseSdkContent failedCould not initialize class android.graphics.TypefaceAnd when I try to run ...
Kik brick mod
下一篇 下篇文章: java.lang.NoClassDefFoundError: Could not initialize class org.codehaus.groovy.vmplugin.v7.Java7
Microphone not working on snapchat or instagram
* What went wrong: Could not initialize class org.codehaus.groovy.runtime.InvokerHelper flutter Could not initialize class org.codehaus.groovy.runtime.InvokerHelper Learn how Grepper helps you improve as a Developer!
French bulldogs for sale in austin texas
按照 Google 官方教程, 在 Android Studio 3.5 初始化 Kotlin 项目时报错: ERROR: Could not download kotlin-compiler-embeddable.jar (org.jetbrains.kotlin:kotlin-compiler-embeddable:1.3.50): No cached version available f
Zx10r ignition bypass
Jul 20, 2020 · What went wrong: Could not initialize class org.codehaus.groovy.runtime.InvokerHelper. Try: Run with --stacktrace option to get the stack trace. Run with --info or --debug option to get more log output. Run with --scan to get full insights. Get more help at https://help.gradle.org. BUILD FAILED in 1s. and this is the screenshoot of my eror in ...
Payroll documents for ppp
Oct 19, 2018 · I currently read this about 'last-modified' HTTP header. Though I have read number of sources, I'm still confused how it is generated for a particular resource.Is it solely depends on the time stamp when the resource has changed in the db.
2017 honda pilot towing review
Best Class Realm Of The Mad God; Tela Class Memorias De Um Ninja Loki; No Mans Sky S Class Fighter Portal Address; Unable To Parse Template Class Android Studio; Could Not Initialize Class Com Ibm Ws Ffdc Ffdcfilter; Div Class Ctr P Id Viewport Div; Letra Da Musica Nois Dois Class A; Realm Of The Mad God New Class; 1 2 3 Dans Ma Classe à Moi

1986 toyota pickup fuel pump relay location

Tzumi alpha gaming

UNSOLVED Build for Android - Could not initialize class org.codehaus.groovy.runtime.InvokerHelper • PawlosCK 1. 0 Votes. 1 Posts. 66 Views. * 仅在可以访问应用商店时使用,若需升级请到扩展程序页开启「开发者模式」后点击「立即更新扩展程序」按钮 *


Wico xh 909 magneto

Could not initialize class org.codehause.groovy.runtime.InvokerHelper. I have a Groovy project that builds just fine on one machine. However, I just moved it to another machine, and now the... 上一篇 上篇文章: java.lang.NoClassDefFoundError: Could not initialize class org.codehaus.groovy.vmplugin.v7.Java7 下一篇 下篇文章: Robolectric单元测试报错“ReflectionHelpers.java java.lang.IllegalAccessException at UnsafeFieldAccessorImpl.java” SPECTRAL data-based estimation of soil heat fluxUSGS Publications Warehouse. Singh, Ramesh K.; Irmak, A.; Walter-Shea, Elizabeth; Verma, S.B.; Suyker, A.E. 2011-01-01. Numerous existing spectral-based soil heat flux (G) models have shown wide variation in performance for maize and soybean cropping systems in Nebraska, indicating the need for localized calibration and model development. 上一篇 上篇文章: java.lang.NoClassDefFoundError: Could not initialize class org.codehaus.groovy.vmplugin.v7.Java7 下一篇 下篇文章: Robolectric单元测试报错“ReflectionHelpers.java java.lang.IllegalAccessException at UnsafeFieldAccessorImpl.java”

  1. Я столкнулся с этой проблемой, когда создавал свое приложение Flutter. Эта ошибка связана с версией gradle, которую вы используете в своем Android-проекте.Could not initialize class org.codehaus.groovy.runtime.InvokerHelper. Try: Run with -stacktrace option to get the stack trace. Run with -info or -debug option to get more log output. Run with -scan to get full insights. Get more help at https://help.gradle.org. BU LD FAILED in 920ms
  2. Q&A for computer enthusiasts and power users. Stack Exchange network consists of 176 Q&A communities including Stack Overflow, the largest, most trusted online community for developers to learn, share their knowledge, and build their careers. May 03, 2012 · NoClassDefFoundError: Could not initialize class org.intellij.plugins.relaxNG.compact.RncTokenTypes: Could not initialize class org.intellij.plugins.relaxNG.compact.RncTokenTypes Benzer hatalar bu firmanın diğer ürünlerinde de var. Daha önce PhpStorm’u denediğim dönemlerde internette kısa bir arama ile problemin Windows’un “local ...
  3. 按照 Google 官方教程, 在 Android Studio 3.5 初始化 Kotlin 项目时报错: ERROR: Could not download kotlin-compiler-embeddable.jar (org.jetbrains.kotlin:kotlin-compiler-embeddable:1.3.50): No cached version available f I've recently found and fallen in love with Cypress for e2e testing, much more so than Selenium, but there's a catch: our web app will actually be within jxbrowser, inside a java app.
  4. gintas-mac:android gintas$ ./gradlew sync FAILURE: Build failed with an exception. * What went wrong: Could not initialize class org.codehaus.groovy.runtime.InvokerHelper * Try: Run with --stacktrace option to get the stack trace. Run with --info or --debug option to get more log output. Run with --scan to get full insights.
  5. GameDev.net is your resource for game development with forums, tutorials, blogs, projects, portfolios, news, and more.
  6. Running an uber jar from sbt assembly results in error: Could not find or load main class; Is there a way to check if a user is signed in with Twitter? python - applying a mask to an array in a for loop; InetAddress.getByName fails behind proxy; C# to VB.NET Conversion : 'Take (of T)' Error What went wrong: Could not initialize class org.codehaus.groovy.runtime.InvokerHelper. Try: Run with --stacktrace option to get the stack trace. Run with --info or --debug option to get more log output. Run with --scan to get full insights. Get more help at https://help.gradle.org
  7. Jul 28, 2020 · Could not open windows registry node Software\JavaSoft\Prefs at root 0xffffffff80000001: Access denied: Core. Navigation and Search: Feature: IDEA-130931: Shift+Ctrl+F7 hit on exception in throws clause of method declaration should highlight where exception is thrown: Feature: IDEA-230679: Search Everywhere: Show all results in one group on All ...
  8. Q&A for computer enthusiasts and power users. Stack Exchange network consists of 176 Q&A communities including Stack Overflow, the largest, most trusted online community for developers to learn, share their knowledge, and build their careers.
  9. idea新建项目时报错: ``` Could not create an instance of type sync_studio_tooling4109_etj5j7903rvcja915lss78bgn. > Could not initialize class org.codehaus.groovy.runtime.InvokerHelper Could not initialize class org.codehaus.groovy.runtime.InvokerHelper ``` 打开一个原先在android studio中建立的项目报错: ``` Cannot convert string value 'JETPACK_COMPOSE' to an enum value ... 供了Java面试题宝典,编程的基础技术教程, 介绍了HTML、Javascript,Java,Ruby , MySQL等各种编程语言的基础知识。 同时本站中也提供了大量的在线实例,通过实例,您可以更好的学习编程。
  10. Mac 问题 Starting a Gradle Daemon, 1 incompatible ...java.lang.NoClassDefFoundError: Could not initialize class org.codehaus.groovy.vmplugin.v7.Java7 at org.codehaus.groovy.vmplugin.VMPluginFactory. Android Studio无法初始化类org.codehaus.groovy.runtime.InvokerHelper. 由于Jdk的版本较低,我遇到了这个问题。 Oct 16, 2020 · * What went wrong: Could not initialize class org.codehaus.groovy.runtime.InvokerHelper flutter Could not initialize class org.codehaus.groovy.runtime.InvokerHelper Learn how Grepper helps you improve as a Developer! Generalization of the quasi-geostrophic Eliassen-Palm flux to include eddy forcing of condensation heating. NASA Technical Reports Server (NTRS) Stone, P. H.; Salustri, G. 1984-01-01
  11. Dec 28, 2020 · 문제Gradle Test 를 하는 과정에서 Could not initialize class org.codehaus.groovy.runtime.InvokerHelper Error 오류가 발생하였다.
  12. Could not initialize class org.codehaus.groovy.classgen.Verifier 如图(原图忘记保存了,不过都是这样的相似的报错) 解决方法这类错误的主要原因是因为Gradle和jdk的版本不符,所以我重新下载安装了最新的gradle-6.5版本(之前一直报错的是gradle-5.2版本),然后再配置好路径 ...

 

5e inquisitive monk

idea新建项目时报错: ``` Could not create an instance of type sync_studio_tooling4109_etj5j7903rvcja915lss78bgn. > Could not initialize class org.codehaus.groovy.runtime.InvokerHelper Could not initialize class org.codehaus.groovy.runtime.InvokerHelper ``` 打开一个原先在android studio中建立的项目报错: ``` Cannot convert string value 'JETPACK_COMPOSE' to an enum value ...Could Not Initialize Class Org.codehaus.groovy.runtime.invokerhelper. Go to. ... To install flutter in visual studio( windows )you need to ... Groovy Language Documentation. Develop for android java issues | Qt Forum. npx react-native run-android Failing in macOS - react-native.On my way creating my own solution regarding doorbells, homeautomation, SIP and stuff I stumbled onto a problem because " Could not initialize class org.codehaus.groovy.runtime.InvokerHelper " The answer: The Flutter Android project is initializing the Gradle settings with version 5.6.2 and this is the cause of the problem.Я столкнулся с этой проблемой, когда создавал свое приложение Flutter. Эта ошибка связана с версией gradle, которую вы используете в своем Android-проекте.Jul 19, 2019 · could not find or load main class org.gradle.wrapper.gradlewrappermain flutter ... ao could not find or load main class ... Could Not Initialize Class Sun Awt ... Jun 04, 2019 · EDIT3: After all tries I made to solve the problem (as I mentioned in my posts), I solved the problem by deleting Plugins folder (Assets/Plugins).I think that is a critical step that you need to do while deleting the "Unity Ads" from Package Manager. gintas-mac:android gintas$ ./gradlew sync FAILURE: Build failed with an exception. * What went wrong: Could not initialize class org.codehaus.groovy.runtime.InvokerHelper * Try: Run with --stacktrace option to get the stack trace. Run with --info or --debug option to get more log output. Run with --scan to get full insights.(1) * 3-2 9 7-5 1 7-(1) 1 1 * * 3-2 9 7-5 1 7 PROFESSIONAL DISC CAMCORDER PROFESSIONAL DISC CAMCORDER PDW-700 PDW-700 The supplied CD-ROM includes operation manuals for the PDW-700 Professional Disc Camcorder (English, Japanese, French, German, Italian, Spanish and Chinese versions) in PDF format.

Jul 20, 2020 · After if you get "Could not initialize class org.codehaus.groovy.runtime.InvokerHelper" 1.install Java SDK 14 and update env path. 2."[Your RN or Flutter Project Folder]\android\gradle\wrapper\gradle-wrapper.properties" this file edit as ...(upgrade gradle version) Could not initialize class org.codehaus.groovy.vmplugin.v7 ... Could not initialize class org.codehaus.groovy.runtime ... To install flutter in visual studio( windows )you need to ... Could not initialize class org.codehaus.groovy.runtime.InvokerHelper** I'm using Windows 10, and this is some additional information. Just in case it can help, Kotlin: 1.3.41 Groovy: 2.5.4 Ant: Apache Ant(TM) version 1.9.14 compiled on March 12 2019 JVM: 14.0.2 (Oracle Corporation 14.0.2+12-46)

Hid nfc card reader

* 仅在可以访问应用商店时使用,若需升级请到扩展程序页开启「开发者模式」后点击「立即更新扩展程序」按钮 * Oct 21, 2018 · java.lang.NoClassDefFoundError: Could not initialize class org.codehaus.groovy.vmplugin.v7.Java7 Post by jkalksma » Sun Apr 12, 2020 8:34 am Hello, my script (on Synology) has been running without problems for a long time but now I get this message. When I tried "react-native run-android" I was receiving errors "Could not initialize class org.codehaus.groovy.runtime.InvokerHelper" + "Failed to install the app. Make sure you have the Android development environment set up".... Solved it by updating the gradle in Android Studio.* What went wrong: Could not create an instance of type org.gradle.initialization.DefaultSettings_Decorated. > Could not initialize class org.codehaus.groovy.reflection.ReflectionCache * Try: Run with --stacktrace option to get the stack trace. Run with --info or --debug option to get more log output. Run with --scan to get full insights.

Tableau row totals not showing

Java™ is the world's leading programming language and platform. AdoptOpenJDK uses infrastructure, build and test scripts to produce prebuilt binaries from OpenJDK™ class libraries and a choice of either OpenJDK or the Eclipse OpenJ9 VM. All AdoptOpenJDK binaries and scripts are open source licensed and available for free. On my way creating my own solution regarding doorbells, homeautomation, SIP and stuff I stumbled onto a problem because " Could not initialize class org.codehaus.groovy.runtime.InvokerHelper " The answer: The Flutter Android project is initializing the Gradle settings with version 5.6.2 and this is the cause of the problem.gintas-mac:android gintas$ ./gradlew sync FAILURE: Build failed with an exception. * What went wrong: Could not initialize class org.codehaus.groovy.runtime.InvokerHelper * Try: Run with --stacktrace option to get the stack trace. Run with --info or --debug option to get more log output. Run with --scan to get full insights.開発メモ その198 Could not initialize class org.codehaus.groovy.reflection.ReflectionCache Introduction Could not initialize class org.codehaus.groovy.reflection.ReflectionCache というエラーが表示される。 Oct 19, 2018 · I currently read this about 'last-modified' HTTP header. Though I have read number of sources, I'm still confused how it is generated for a particular resource.Is it solely depends on the time stamp when the resource has changed in the db.

Remington model 700 grades

Dec 28, 2020 · 문제Gradle Test 를 하는 과정에서 Could not initialize class org.codehaus.groovy.runtime.InvokerHelper Error 오류가 발생하였다. Jul 20, 2020 · After if you get "Could not initialize class org.codehaus.groovy.runtime.InvokerHelper" 1.install Java SDK 14 and update env path. 2."[Your RN or Flutter Project Folder]\android\gradle\wrapper\gradle-wrapper.properties" this file edit as ...(upgrade gradle version) Could not initialize class org.codehaus.groovy.runtime.InvokerHelper. Try: Run with –stacktrace option to get the stack trace. Run with –info or –debug option to get more log output. Run with –scan to get full insights. Get more help at https://help.gradle.org. BU LD FAILED in 2s Gradle task assembleDebug failed with exit code 1 Exited ... Antes: distributionUrl=https\://services.gradle.org/distributions/gradle-5.6.2-all.zipDepois [resolvido] : distributionUrl=https\://services.gradle.org/distr... Tropical Gravity Wave Momentum Fluxes and Latent Heating Distributions. NASA Technical Reports Server (NTRS) Geller, Marvin A.; Zhou, Tiehan; Love, Peter T. 2015-01-01. Recent satellite determinations of global distributions of absolute gravity wave (GW) momentum fluxes in the lower stratosphere show maxima over the summer subtropical continents and little evidence of GW momentum Antes: distributionUrl=https\://services.gradle.org/distributions/gradle-5.6.2-all.zipDepois [resolvido] : distributionUrl=https\://services.gradle.org/distr...* 仅在可以访问应用商店时使用,若需升级请到扩展程序页开启「开发者模式」后点击「立即更新扩展程序」按钮 * Antes: distributionUrl=https\://services.gradle.org/distributions/gradle-5.6.2-all.zipDepois [resolvido] : distributionUrl=https\://services.gradle.org/distr...Could not initialize class org.codehaus.groovy.runtime.InvokerHelper. In a similar question in stack-overflow Android Studio Could not initialize class org.codehaus.groovy.runtime.InvokerHelper it was recommended to . install java jdk-14 ; upgrade to gradle version 6.3; I changed the jdk to 14 in IntelliJ in 2 places: Oct 16, 2020 · * What went wrong: Could not initialize class org.codehaus.groovy.runtime.InvokerHelper flutter Could not initialize class org.codehaus.groovy.runtime.InvokerHelper Learn how Grepper helps you improve as a Developer! NoClassDefFoundError: Could not initialize class com.intellij.profiler.ultimate.async.UtilsKt exception on project creating: Bug: IDEA-197863: JSON scheme: yaml ... Could not initialize class org.apache.jasper.compiler.JspUtil_course. 2014-12-10. 我原来是tomcat5 32位及jdk1.632位,一直是正常的,今天换为jdk1.6 x64 及tomcat6 x64就不行了,访问就出Could not initialize class org. Could not initialize class org.codehaus.groovy.classgen.Verifier 如图(原图忘记保存了,不过都是这样的相似的报错) 解决方法这类错误的主要原因是因为Gradle和jdk的版本不符,所以我重新下载安装了最新的gradle-6.5版本(之前一直报错的是gradle-5.2版本),然后再配置好路径 ... Gradle error: Could not initialize class org.codehaus.groovy.runtime.InvokerHelper 5141; android9.0自动使用24小时制 1308; WorkManager的进阶 872; Spark-SQL官网翻译--Getting Started 628; flutter 混合开发 576

Is global entry card a valid id for alcohol

Jul 28, 2020 · Could not open windows registry node Software\JavaSoft\Prefs at root 0xffffffff80000001: Access denied: Core. Navigation and Search: Feature: IDEA-130931: Shift+Ctrl+F7 hit on exception in throws clause of method declaration should highlight where exception is thrown: Feature: IDEA-230679: Search Everywhere: Show all results in one group on All ... Tropical Gravity Wave Momentum Fluxes and Latent Heating Distributions. NASA Technical Reports Server (NTRS) Geller, Marvin A.; Zhou, Tiehan; Love, Peter T. 2015-01-01. Recent satellite determinations of global distributions of absolute gravity wave (GW) momentum fluxes in the lower stratosphere show maxima over the summer subtropical continents and little evidence of GW momentum Could not initialize class org.apache.jasper.compiler.JspUtil_course. 2014-12-10. 我原来是tomcat5 32位及jdk1.632位,一直是正常的,今天换为jdk1.6 x64 及tomcat6 x64就不行了,访问就出Could not initialize class org. Best Class Realm Of The Mad God; Tela Class Memorias De Um Ninja Loki; No Mans Sky S Class Fighter Portal Address; Unable To Parse Template Class Android Studio; Could Not Initialize Class Com Ibm Ws Ffdc Ffdcfilter; Div Class Ctr P Id Viewport Div; Letra Da Musica Nois Dois Class A; Realm Of The Mad God New Class; 1 2 3 Dans Ma Classe à Moi Jul 20, 2020 · After if you get "Could not initialize class org.codehaus.groovy.runtime.InvokerHelper" 1.install Java SDK 14 and update env path. 2."[Your RN or Flutter Project Folder]\android\gradle\wrapper\gradle-wrapper.properties" this file edit as ...(upgrade gradle version) May 03, 2012 · NoClassDefFoundError: Could not initialize class org.intellij.plugins.relaxNG.compact.RncTokenTypes: Could not initialize class org.intellij.plugins.relaxNG.compact.RncTokenTypes Benzer hatalar bu firmanın diğer ürünlerinde de var. Daha önce PhpStorm’u denediğim dönemlerde internette kısa bir arama ile problemin Windows’un “local ... I've recently found and fallen in love with Cypress for e2e testing, much more so than Selenium, but there's a catch: our web app will actually be within jxbrowser, inside a java app.

Topps chrome basketball cards

Gradle error: Could not initialize class org.codehaus.groovy.runtime.InvokerHelper 5141; android9.0自动使用24小时制 1308; WorkManager的进阶 872; Spark-SQL官网翻译--Getting Started 628; flutter 混合开发 576 IReport error: Could not initialize class net.sf.jasperreports.engine.util.JRStyledTextParser Problem Description: Using jaspereport do print templates, local debugging, no problems, normal print; but posted to the server, the background will be given the wrong information is as follows every time you print: Could not initialize class org.codehaus.groovy.runtime.InvokerHelper * Try: Run with –stacktrace option to get the stack trace. Run with –info or –debug option to get more log output. Run with –scan to get full insights. * Get more help at https://help.gradle.org. BUILD FAILED in 932ms. اگ میشه لطفن راهنماییم کنید . java.lang.NoClassDefFoundError: Could not initialize class .... エラー内容としては「クラスが見つからない」と言っているのだが、しかしその説明としては「クラスの初期化ができなかった」となっている。当然だが、クラスは存在し、初期化ができないだけのようだ。 Could not initialize class org.codehaus.groovy.runtime.InvokerHelper. In a similar question in stack-overflow Android Studio Could not initialize class org.codehaus.groovy.runtime.InvokerHelper it was recommended to . install java jdk-14 ; upgrade to gradle version 6.3; I changed the jdk to 14 in IntelliJ in 2 places: Jeff Thompson added a comment - 2018-10-29 21:40 This looks like a communication failure between master and agent. The connection can be broken by many external causes. Commonly these have to do with networking, system, or other environmental is Could not initialize class org.codehaus.groovy.runtime.InvokerHelper HAXM is not installed on this machine Open SDK Manager and download Intel x86 Emulator Accelerator (HAXM installer) if you haven't.

How to upload a zoom video to canvas

Could not initialize class org.codehaus.groovy.classgen.Verifier As shown in the figure (the original picture was forgotten to save, but they all reported similar errors) * What went wrong: Could not initialize class org.codehaus.groovy.runtime.InvokerHelper * Try: Run with--stacktrace option to get the stack trace. Run with--info or --debug option to get more log output. Run with--scan to get full insights. * Get more help at https: //help.gradle.org BUILD FAILED in 882 ms org.apache.catalina.startup.Catalina stopServer SEVERE: Could not contact localhost:8005. Tomcat may. 2017年07月21日 14:52:10 子木HAPPY阳VIP 阅读数:14134 标签: tomcat nginx 更多 MyBatis 报错 Could not initialize class 4334 2018-07-02 MyBatis中setting标签自动映射级别改成full后报了一个无法初始化的错误java.lang.NoClassDefFoundError: Could not initialize class cn.smbms.utils.MyBatisUtil最后发现写成小写的原因,改成大写的FULL以后就可以了 GameDev.net is your resource for game development with forums, tutorials, blogs, projects, portfolios, news, and more.

C3h8 + 5o2 3co2 + 4h2o

On my way creating my own solution regarding doorbells, homeautomation, SIP and stuff I stumbled onto a problem because " Could not initialize class org.codehaus.groovy.runtime.InvokerHelper " The answer: The Flutter Android project is initializing the Gradle settings with version 5.6.2 and this is the cause of the problem. Oct 16, 2020 · * What went wrong: Could not initialize class org.codehaus.groovy.runtime.InvokerHelper flutter Could not initialize class org.codehaus.groovy.runtime.InvokerHelper Learn how Grepper helps you improve as a Developer! What went wrong: Could not initialize class org.codehaus.groovy.runtime.InvokerHelper. Try: Run with --stacktrace option to get the stack trace. Run with --info or --debug option to get more log output. Run with --scan to get full insights. Get more help at https://help.gradle.org. BUILD FAILED in 1m 23s

Meter parts inc

* What went wrong: Could not initialize class org.codehaus.groovy.runtime.InvokerHelper * Try: Run with --stacktrace option to get the stack trace. Run with --info or --debug option to get more log output. Jul 28, 2020 · Could not open windows registry node Software\JavaSoft\Prefs at root 0xffffffff80000001: Access denied: Core. Navigation and Search: Feature: IDEA-130931: Shift+Ctrl+F7 hit on exception in throws clause of method declaration should highlight where exception is thrown: Feature: IDEA-230679: Search Everywhere: Show all results in one group on All ... Get code examples like "* What went wrong: Could not initialize class org.codehaus.groovy.runtime.InvokerHelper" instantly right from your google search results with the Grepper Chrome Extension.Oct 16, 2020 · Get code examples like "Could not initialize class org.codehaus.groovy.runtime.InvokerHelper java 15.0.1" instantly right from your google search results with the Grepper Chrome Extension.

Unlimited off road simulator mod apk

Step 6: Creating a New Java Class file. Right Click on the Newly created Package → New → Class. Step 7:Type In a Name for your Java Class file, click on the check box for “public static void main (String args[])” Click on Finish. Step 8: The Java class file is created and ready for Java Scripting. * What went wrong: Could not initialize class org.codehaus.groovy.runtime.InvokerHelper * Try: Run with --stacktrace option to get the stack trace. Run with --info or --debug option to get more log output.

Wasmo aragti news

> Could not initialize class c... react-native failed to start android project: A problem occurred configuring project':app'. Enter the specified project in cmd, enter react-native run-android, this problem occurs after running Since android stuido has not been installed before, and Android has not been developed before, it ... Case putty or other tools Linux ssh connection also appears correct root password Access denied Noto other users can not board, only the root user can not login a user can not disapproved; The light cat Pon does not light up; Intelij Idea remote debugging Tomcat configuration; 7-47 Ancient Style Typesetting (20 points) Gradle error: Could not initialize class org.codehaus.groovy.runtime.InvokerHelper 技术标签: gradlew 执行命令报错 android 最近在最自定义lint,根据Google的官方Demo,运行总是报这个错,网上搜索了一下没什么好的结果,因此尝试执行gradlew app:lintDebug --stacktrace 其中有一行有JAVA_HOME is ... Get code examples like "* What went wrong: Could not initialize class org.codehaus.groovy.runtime.InvokerHelper" instantly right from your google search results with the Grepper Chrome Extension.IReport error: Could not initialize class net.sf.jasperreports.engine.util.JRStyledTextParser Problem Description: Using jaspereport do print templates, local debugging, no problems, normal print; but posted to the server, the background will be given the wrong information is as follows every time you print: * What went wrong: Could not create an instance of type org.gradle.initialization.DefaultSettings_Decorated. > Could not initialize class org.codehaus.groovy.reflection.ReflectionCache * Try: Run with --stacktrace option to get the stack trace. Run with --info or --debug option to get more log output. Run with --scan to get full insights. Scala combines object-oriented and functional programming in one concise, high-level language. Scala's static types help avoid bugs in complex applications, and its JVM and JavaScript runtimes let you build high-performance systems with easy access to huge ecosystems of libraries. Scala classes are ...

Craftsman radial arm saw repair

hbase报错Could not initialize class org.apache.hadoop.hbase.protobuf.ProtobufUtil 2019年10月27日 来源: hbase 按照 Google 官方教程, 在 Android Studio 3.5 初始化 Kotlin 项目时报错: ERROR: Could not download kotlin-compiler-embeddable.jar (org.jetbrains.kotlin:kotlin-compiler-embeddable:1.3.50): No cached version available f * What went wrong: Could not initialize class org.codehaus.groovy.runtime.InvokerHelper * Try: Run with--stacktrace option to get the stack trace. Run with--info or --debug option to get more log output. Run with--scan to get full insights. * Get more help at https: //help.gradle.org BUILD FAILED in 882 ms

Fn a2 upper

The errors come if android sdk is not installed in the windows operating system: ‘could not initialize class org.codehaus.groovy.runtime.invokerhelper’ so i recomend installing android studio along... Dec 28, 2020 · 문제Gradle Test 를 하는 과정에서 Could not initialize class org.codehaus.groovy.runtime.InvokerHelper Error 오류가 발생하였다. UNSOLVED Build for Android - Could not initialize class org.codehaus.groovy.runtime.InvokerHelper • PawlosCK 1. 0 Votes. 1 Posts. 66 Views. The errors come if android sdk is not installed in the windows operating system: 'could not initialize class org.codehaus.groovy.runtime.invokerhelper' so i recomend installing android studio along...Gradle error: Could not initialize class org.codehaus.groovy.runtime.InvokerHelper 技术标签: gradlew 执行命令报错 android 最近在最自定义lint,根据Google的官方Demo,运行总是报这个错,网上搜索了一下没什么好的结果,因此尝试执行gradlew app:lintDebug --stacktrace 其中有一行有JAVA_HOME is ... When I tried "react-native run-android" I was receiving errors "Could not initialize class org.codehaus.groovy.runtime.InvokerHelper" + "Failed to install the app. Make sure you have the Android development environment set up".... Solved it by updating the gradle in Android Studio.Jul 28, 2020 · Could not open windows registry node Software\JavaSoft\Prefs at root 0xffffffff80000001: Access denied: Core. Navigation and Search: Feature: IDEA-130931: Shift+Ctrl+F7 hit on exception in throws clause of method declaration should highlight where exception is thrown: Feature: IDEA-230679: Search Everywhere: Show all results in one group on All ... idea部署tomcat启动报错java.lang.NoClassDefFoundError: Could not initialize class org.springframework.be... 这一次的启动错误,让我花了整整两天解决(未完全解决),导致都没有产出,的确让人抓狂,必须来一篇博客记载,方才去除一波疼痛。